{"text_format":"1","workbook":"xlsx","n_sheets":9,"sheets":["Base Bid - old","Summary","Base Bid - Nontax","Base Bid - Tax","Add Alt 1 - Nontax","Add Alt 2 - Nontax","Add Alt 3 - Nontax","Detail List","Quantities"],"not_rendered":{"charts":0,"images":0,"macros":0,"external_links":0,"defined_names":13,"comments":0,"pivot_tables":0},"unopened":[],"bounds":{"document_bytes":16777216,"sheet_cells":100000,"rows_first":2000,"rows_last":500,"rows_between":2000,"halvings":0,"cell_chars":16384,"cell_head_chars":4096},"cells_cut":0,"cells_raw":0,"read":"whole","date_system":"1900"}

{"sheet":"Base Bid - old","index":0,"n_rows":70,"n_cols":10,"rows_kept":70,"cut":false,"hidden":true,"merged":[[3,0,5,7]]}
["Base Bid Schedule"]
["City of Arlington and Stillaguamish Tribe"]
["Gifford Ave Sidewalks"]
["NOTE: All entries must be typed or written in ink. Unit prices for all items, all extensions, lump sum prices, and the total amount of bid must be shown. Show unit prices in both words and figures; where conflicts occur, the written words will take precedence and be used to determine the total amount bid. The total bid amount shall include all work as included in the contract documents and sales tax.\n"]
[]
[]
["Item No.","DESCRIPTION","WSDOT Standard Item No.","WSDOT\nSpec\nRef Sect","Approx. Quantity","UNIT","Unit Price","Total Price","Unit Price","Total Price"]
[]
[null,"PREPARATION"]
[1,{"$f":"VLOOKUP(C10,'Detail List'!$A$2:$G$5000,3,FALSE)","v":"MOBILIZATION"},"0001","1-09.7",1,{"$f":"VLOOKUP(C10,'Detail List'!$A$2:$I$5000,2,FALSE)","v":"L.S."},"$","$",3000,{"$f":"E10*I10","v":3000}]
[null,"(Unit Price in Words) ___________________________________________________"]
[2,{"$f":"VLOOKUP(C12,'Detail List'!$A$2:$G$5000,3,FALSE)","v":"REMOVAL OF STRUCTURE AND OBSTRUCTION"},"0050","2-02.4",1,{"$f":"VLOOKUP(C12,'Detail List'!$A$2:$I$5000,2,FALSE)","v":"L.S."},"$","$",7350,{"$f":"E12*I12","v":7350}]
[null,"(Unit Price in Words) ___________________________________________________"]
[3,"SAWCUT EXISTING PAVEMENT","----","GSP",710,"L.F.","$","$",2.4,{"$f":"E14*I14","v":1704}]
[null,"(Unit Price in Words) ___________________________________________________"]
[]
[null,"GRADING"]
[4,{"$f":"VLOOKUP(C18,'Detail List'!$A$2:$G$5000,3,FALSE)","v":"ROADWAY EXCAVATION INCL. HAUL"},"0310","2-03.4",310,{"$f":"VLOOKUP(C18,'Detail List'!$A$2:$I$5000,2,FALSE)","v":"C.Y."},"$","$",24,{"$f":"E18*I18","v":7440}]
[null,"(Unit Price in Words) ___________________________________________________"]
[]
[null,"SURFACING"]
[5,{"$f":"VLOOKUP(C22,'Detail List'!$A$2:$G$5000,3,FALSE)","v":"CRUSHED SURFACING BASE COURSE"},"5100","4-04.4",20,{"$f":"VLOOKUP(C22,'Detail List'!$A$2:$I$5000,2,FALSE)","v":"TON"},"$","$",32,{"$f":"E22*I22","v":640}]
[null,"(Unit Price in Words) ___________________________________________________"]
[]
[null,"HOT MIX ASPHALT"]
[6,{"$f":"VLOOKUP(C26,'Detail List'!$A$2:$G$5000,3,FALSE)","v":"COMMERCIAL HMA"},"5875","5-04.4",24,{"$f":"VLOOKUP(C26,'Detail List'!$A$2:$I$5000,2,FALSE)","v":"TON"},"$","$",210,{"$f":"E26*I26","v":5040}]
[null,"(Unit Price in Words) ___________________________________________________"]
[]
[null,"EROSION CONTROL AND PLANTING"]
[7,"TOPSOIL TYPE B","6405","8-02.4",25,{"$f":"VLOOKUP(C30,'Detail List'!$A$2:$I$5000,2,FALSE)","v":"C.Y."},"$","$",37.5,{"$f":"E30*I30","v":937.5}]
{"$rows_left_out":41}
{"sheet":"Summary","index":1,"n_rows":25,"n_cols":7,"rows_kept":25,"cut":false,"hidden":false,"merged":[]}
["Engineer's Estimate",null,null,null,"Reece Bid"]
[]
["Airport Blvd Phase I Estimate Costs",null,null,null,"Airport Blvd Phase I Estimate Costs"]
[]
["Roadway","Base Bid",{"$f":"'Base Bid - Nontax'!J100","v":818000},null,"Roadway","Base Bid",612405.80000000005]
["Water","Base Bid",{"$f":"'Base Bid - Tax'!L58","v":107412.5025},null,"Water","Base Bid",{"$f":"'Base Bid - Tax'!P58","v":94288.691999999995}]
["Sewer","Base Bid",{"$f":"'Base Bid - Tax'!M58","v":84587.497499999998},null,"Sewer","Base Bid",{"$f":"'Base Bid - Tax'!Q58","v":94837.122000000003}]
["Overlay","Alternate 1",{"$f":"'Add Alt 1 - Nontax'!J21","v":56600},null,"Overlay","Alternate 1",41642.199999999997]
["Curb","Alternate 2",{"$f":"'Add Alt 2 - Nontax'!J19","v":132000},null,"Curb","Alternate 2",58820]
["Landscaping","Alternate 3",{"$f":"'Add Alt 3 - Nontax'!J55","v":479000},null,"Landscaping","Alternate 3",241959.8]
[null,null,null,null,"Change Order - 1",null,153481.32500000001]
["GRAND TOTAL",null,{"$f":"SUM(C5:C10)","v":1677600}]
[null,null,null,null,"GRAND TOTAL",null,{"$f":"SUM(G5:G11)","v":1297434.939}]
[]
[]
[]
["Funding",null,null,null,"Funding"]
[]
["PSRC STP Grant",null,452000,null,"PSRC STP Grant",null,452000]
["Airport Fund",null,475000,null,"Airport Fund",null,475000]
["COA Water Utility",null,90000,null,"COA Water Utility",null,{"$f":"G6","v":94288.691999999995}]
["COA Sewer Utility",null,84000,null,"COA Sewer Utility",null,{"$f":"G13-SUM(G19:G21)","v":276146.24699999997}]
["COA Transpo Fund",null,{"$f":"1293000-SUM(C19:C22)","v":192000},null,"COA Transpo Fund",null,0]
[]
["Total Funding",null,{"$f":"SUM(C18:C24)","v":1293000},null,"Total Funding",null,{"$f":"SUM(G18:G24)","v":1297434.939}]

{"sheet":"Base Bid - Nontax","index":2,"n_rows":100,"n_cols":11,"rows_kept":100,"cut":false,"hidden":false,"merged":[[3,0,5,7]]}
["Base Bid Schedule - Roadway"]
["City of Arlington"]
["Airport Blvd Phase 1A"]
["NOTE: All entries must be typed or written in ink. Unit prices for all items, all extensions, lump sum prices, and the total amount of bid must be shown. Show unit prices in both words and figures; where conflicts occur, the written words will take precedence and be used to determine the total amount bid. The total bid amount shall include all work as included in the contract documents and applicable tax.\n"]
[]
[null,null,null,null,null,null,null,null,null,{"$f":"J100","v":818000}]
["Item No.","DESCRIPTION","WSDOT Standard Item No.","WSDOT\nSpec\nRef Sect","Approx. Quantity","UNIT","Unit Price","Total Price","Unit Price","Total Price"]
[]
[null,"PREPARATION"]
[101,{"$f":"VLOOKUP(C10,'Detail List'!$A$2:$G$5000,3,FALSE)","v":"MOBILIZATION"},"0001","1-09.7",1,{"$f":"VLOOKUP(C10,'Detail List'!$A$2:$I$5000,2,FALSE)","v":"L.S."},"$","$",55000,{"$f":"E10*I10","v":55000}]
[null,"(Unit Price in Words) ___________________________________________________"]
[102,{"$f":"VLOOKUP(C12,'Detail List'!$A$2:$G$5000,3,FALSE)","v":"REMOVAL OF STRUCTURE AND OBSTRUCTION"},"0050","2-02.5",1,{"$f":"VLOOKUP(C12,'Detail List'!$A$2:$I$5000,2,FALSE)","v":"L.S."},"$","$",1500,{"$f":"E12*I12","v":1500}]
[null,"(Unit Price in Words) ___________________________________________________"]
[103,{"$f":"VLOOKUP(C14,'Detail List'!$A$2:$G$5000,3,FALSE)","v":"REMOVING ASPHALT CONC. PAVEMENT"},"0120","GSP",{"$f":"ROUND((1*(4048-2100)+(40*20))/9,-1)","v":310},{"$f":"VLOOKUP(C14,'Detail List'!$A$2:$I$5000,2,FALSE)","v":"S.Y."},"$","$",3.5,{"$f":"E14*I14","v":1085}]
[null,"(Unit Price in Words) ___________________________________________________"]
[104,{"$f":"VLOOKUP(C16,'Detail List'!$A$2:$G$5000,3,FALSE)","v":"CLEARING AND GRUBBING"},"0025","2-01.5",{"$f":"ROUND((Quantities!C3+Quantities!C12*9+Quantities!C53)/43560,1)","v":4},{"$f":"VLOOKUP(C16,'Detail List'!$A$2:$I$5000,2,FALSE)","v":"ACRE"},"$","$",2000,{"$f":"E16*I16","v":8000}]
[null,"(Unit Price in Words) ___________________________________________________"]
[105,"SAWCUT EXISTING PAVEMENT","---","SP",{"$f":"Quantities!C29+Quantities!C31","v":2124.42},"L.F.","$","$",1.5,{"$f":"E18*I18","v":3186.63}]
[null,"(Unit Price in Words) ___________________________________________________"]
[]
[null,"EROSION CONTROL AND ROADSIDE RESTORATION"]
[107,{"$f":"VLOOKUP(C22,'Detail List'!$A$2:$G$5000,3,FALSE)","v":"WATTLE"},"6479","8-01.5",{"$f":"80*10*3","v":2400},{"$f":"VLOOKUP(C22,'Detail List'!$A$2:$I$5000,2,FALSE)","v":"L.F."},"$","$",5,{"$f":"E22*I22","v":12000}]
[null,"(Unit Price in Words) ___________________________________________________"]
[108,{"$f":"VLOOKUP(C24,'Detail List'!$A$2:$G$5000,3,FALSE)","v":"INLET PROTECTION"},"6471","8-01.5",14,{"$f":"VLOOKUP(C24,'Detail List'!$A$2:$I$5000,2,FALSE)","v":"EACH"},"$","$",75,{"$f":"E24*I24","v":1050}]
[null,"(Unit Price in Words) ___________________________________________________"]
[109,{"$f":"VLOOKUP(C26,'Detail List'!$A$2:$G$5000,3,FALSE)","v":"STABILIZED CONSTRUCTION ENTRANCE"},"6468","8-01.5",170,{"$f":"VLOOKUP(C26,'Detail List'!$A$2:$I$5000,2,FALSE)","v":"S.Y."},"$","$",5,{"$f":"E26*I26","v":850}]
[null,"(Unit Price in Words) ___________________________________________________"]
[110,{"$f":"VLOOKUP(C28,'Detail List'!$A$2:$G$5000,3,FALSE)","v":"EROSION/WATER POLLUTION CONTROL"},"6490","8-01.5",1,"L.S.","$","$",2000,{"$f":"E28*I28","v":2000}]
[null,"(Unit Price in Words) ___________________________________________________"]
[111,{"$f":"VLOOKUP(C30,'Detail List'!$A$2:$G$5000,3,FALSE)","v":"SEEDING AND FERTILIZING"},"6412","8-01.5",{"$f":"ROUND(Quantities!C53*1.5/43560,1)","v":1.1000000000000001},{"$f":"VLOOKUP(C30,'Detail List'!$A$2:$I$5000,2,FALSE)","v":"ACRE"},"$","$",3000,{"$f":"E30*I30","v":3300.0000000000005}]
{"$rows_left_out":71}
{"sheet":"Base Bid - Tax","index":3,"n_rows":58,"n_cols":17,"rows_kept":58,"cut":false,"hidden":false,"merged":[[3,0,5,7]]}
["Base Bid Schedule - Utilities"]
["City of Arlington"]
["Airport Blvd Phase 1A"]
["NOTE: All entries must be typed or written in ink. Unit prices for all items, all extensions, lump sum prices, and the total amount of bid must be shown. Show unit prices in both words and figures; where conflicts occur, the written words will take precedence and be used to determine the total amount bid. The total bid amount shall include all work as included in the contract documents and sales tax.\n"]
[]
[null,null,null,null,null,null,null,null,null,{"$f":"J58","v":192000},null,null,null,null,"Reece Bid"]
["Item No.","DESCRIPTION","WSDOT Standard Item No.","WSDOT\nSpec\nRef Sect","Approx. Quantity","UNIT","Unit Price","Total Price","Unit Price","Total Price",null,"Water","Sewer",null,null,"Water","Sewer"]
[]
[null,"PREPARATION"]
[201,{"$f":"VLOOKUP(C10,'Detail List'!$A$2:$G$5000,3,FALSE)","v":"MOBILIZATION"},"0001","1-09.7",1,{"$f":"VLOOKUP(C10,'Detail List'!$A$2:$I$5000,2,FALSE)","v":"L.S."},"$","$",12000,{"$f":"E10*I10","v":12000},null,{"$f":"J10*0.5","v":6000},{"$f":"J10*0.5","v":6000},null,2900,{"$f":"O10*0.5","v":1450},{"$f":"O10*0.5","v":1450}]
[null,"(Unit Price in Words) ___________________________________________________"]
[202,{"$f":"VLOOKUP(C12,'Detail List'!$A$2:$G$5000,3,FALSE)","v":"REMOVAL OF STRUCTURE AND OBSTRUCTION"},"0050","2-02.5",1,{"$f":"VLOOKUP(C12,'Detail List'!$A$2:$I$5000,2,FALSE)","v":"L.S."},"$","$",2000,{"$f":"E12*I12","v":2000},null,{"$f":"J12*0.5","v":1000},{"$f":"J12*0.5","v":1000},null,500,{"$f":"O12*0.5","v":250},{"$f":"O12*0.5","v":250}]
[null,"(Unit Price in Words) ___________________________________________________"]
[]
[null,"WATER"]
[203,{"$f":"VLOOKUP(C16,'Detail List'!$A$2:$G$5000,3,FALSE)","v":"HYDRANT ASSEMBLY"},"3846","7-14.5",2,{"$f":"VLOOKUP(C16,'Detail List'!$A$2:$I$5000,2,FALSE)","v":"EACH"},"$","$",3800,{"$f":"E16*I16","v":7600},null,{"$f":"J16","v":7600},null,null,7150,{"$f":"O16","v":7150}]
[null,"(Unit Price in Words) ___________________________________________________"]
[204,{"$f":"VLOOKUP(C18,'Detail List'!$A$2:$G$5000,3,FALSE)","v":"RESETTING EXISTING HYDRANTS"},"3848","7-14.5",11,{"$f":"VLOOKUP(C18,'Detail List'!$A$2:$I$5000,2,FALSE)","v":"EACH"},"$","$",2500,{"$f":"E18*I18","v":27500},null,{"$f":"J18","v":27500},null,null,6930,{"$f":"O18","v":6930}]
[null,"(Unit Price in Words) ___________________________________________________"]
[205,{"$f":"VLOOKUP(C20,'Detail List'!$A$2:$G$5000,3,FALSE)","v":"DUCTILE IRON PIPE FOR WATER MAIN 6 IN. DIAM."},"3866","7-09.5",20,{"$f":"VLOOKUP(C20,'Detail List'!$A$2:$I$5000,2,FALSE)","v":"L.F."},"$","$",52,{"$f":"E20*I20","v":1040},null,{"$f":"J20","v":1040},null,null,600,{"$f":"O20","v":600}]
[null,"(Unit Price in Words) ___________________________________________________"]
[206,{"$f":"VLOOKUP(C22,'Detail List'!$A$2:$G$5000,3,FALSE)","v":"DUCTILE IRON PIPE FOR WATER MAIN 8 IN. DIAM."},"3867","7-09.5",{"$f":"83+83","v":166},{"$f":"VLOOKUP(C22,'Detail List'!$A$2:$I$5000,2,FALSE)","v":"L.F."},"$","$",50,{"$f":"E22*I22","v":8300},null,{"$f":"J22","v":8300},null,null,15272,{"$f":"O22","v":15272}]
[null,"(Unit Price in Words) ___________________________________________________"]
[207,{"$f":"VLOOKUP(C24,'Detail List'!$A$2:$G$5000,3,FALSE)","v":"DUCTILE IRON PIPE FOR WATER MAIN 12 IN. DIAM."},"3869","7-09.5",250,{"$f":"VLOOKUP(C24,'Detail List'!$A$2:$I$5000,2,FALSE)","v":"L.F."},"$","$",60,{"$f":"E24*I24","v":15000},null,{"$f":"J24","v":15000},null,null,17750,{"$f":"O24","v":17750}]
[null,"(Unit Price in Words) ___________________________________________________"]
[208,{"$f":"VLOOKUP(C26,'Detail List'!$A$2:$G$5000,3,FALSE)","v":"GATE VALVE 6 IN."},"6155","7-12.5",2,{"$f":"VLOOKUP(C26,'Detail List'!$A$2:$I$5000,2,FALSE)","v":"EACH"},"$","$",1000,{"$f":"E26*I26","v":2000},null,{"$f":"J26","v":2000},null,null,1900,{"$f":"O26","v":1900}]
[null,"(Unit Price in Words) ___________________________________________________"]
[209,{"$f":"VLOOKUP(C28,'Detail List'!$A$2:$G$5000,3,FALSE)","v":"GATE VALVE 8 IN."},"6160","7-12.5",6,{"$f":"VLOOKUP(C28,'Detail List'!$A$2:$I$5000,2,FALSE)","v":"EACH"},"$","$",1100,{"$f":"E28*I28","v":6600},null,{"$f":"J28","v":6600},null,null,7590,{"$f":"O28","v":7590}]
[null,"(Unit Price in Words) ___________________________________________________"]
[210,"WATER SERVICE CONNECTION 2 IN. DIAM. (>30')","3858","7-15.5, GSP",1,{"$f":"VLOOKUP(C30,'Detail List'!$A$2:$I$5000,2,FALSE)","v":"EACH"},"$","$",850,{"$f":"E30*I30","v":850},null,{"$f":"J30","v":850},null,null,1800,{"$f":"O30","v":1800}]
{"$rows_left_out":29}
{"sheet":"Add Alt 1 - Nontax","index":4,"n_rows":21,"n_cols":11,"rows_kept":21,"cut":false,"hidden":false,"merged":[[3,0,5,7]]}
["Alternative 1 Bid Schedule - Overlay"]
["City of Arlington"]
["Airport Blvd Phase 1A"]
["NOTE: All entries must be typed or written in ink. Unit prices for all items, all extensions, lump sum prices, and the total amount of bid must be shown. Show unit prices in both words and figures; where conflicts occur, the written words will take precedence and be used to determine the total amount bid. The total bid amount shall include all work as included in the contract documents and applicable tax.\n"]
[]
[null,null,null,null,null,null,null,null,null,{"$f":"J21","v":56600}]
["Item No.","DESCRIPTION","WSDOT Standard Item No.","WSDOT\nSpec\nRef Sect","Approx. Quantity","UNIT","Unit Price","Total Price","Unit Price","Total Price"]
[]
[null,"PREPARATION"]
[301,{"$f":"VLOOKUP(C10,'Detail List'!$A$2:$G$5000,3,FALSE)","v":"MOBILIZATION"},"0001","1-09.7",1,{"$f":"VLOOKUP(C10,'Detail List'!$A$2:$I$5000,2,FALSE)","v":"L.S."},"$","$",4000,{"$f":"E10*I10","v":4000}]
[null,"(Unit Price in Words) ___________________________________________________"]
[]
[null,"HOT MIX ASPHALT"]
[302,{"$f":"VLOOKUP(C14,'Detail List'!$A$2:$G$5000,3,FALSE)","v":"PLANING BITUMINOUS PAVEMENT"},"5711","5-04.5",{"$f":"ROUND(Quantities!C101,-1)","v":1350},{"$f":"VLOOKUP(C14,'Detail List'!$A$2:$I$5000,2,FALSE)","v":"S.Y."},"$","$",5,{"$f":"E14*I14","v":6750}]
[null,"(Unit Price in Words) ___________________________________________________"]
[303,"HMA FOR PAVEMENT CL. 1/2 IN. PG 64-22","5739","5-04.5",{"$f":"ROUND(Quantities!C109,-1)","v":540},{"$f":"VLOOKUP(C16,'Detail List'!$A$2:$I$5000,2,FALSE)","v":"TON"},"$","$",{"$f":"'Base Bid - Nontax'!I54","v":80},{"$f":"E16*I16","v":43200}]
[null,"(Unit Price in Words) ___________________________________________________"]
[]
[null,null,null,null,null,null,"TOTAL OVERLAY ALTERNATIVE 1",null,"Subtototal",{"$f":"SUM(J8:J18)","v":53950}]
[null,null,null,null,null,null,null,null,"Contingency",{"$f":"56600-J19","v":2650},{"$f":"J20/J19","v":4.911955514365153E-2}]
[null,null,null,null,null,null,null,null,"TOTAL",{"$f":"SUM(J19:J20)","v":56600}]

{"sheet":"Add Alt 2 - Nontax","index":5,"n_rows":19,"n_cols":11,"rows_kept":19,"cut":false,"hidden":false,"merged":[[3,0,5,7]]}
["Alternative 2 Bid Schedule - Curb"]
["City of Arlington"]
["Airport Blvd Phase 1A"]
["NOTE: All entries must be typed or written in ink. Unit prices for all items, all extensions, lump sum prices, and the total amount of bid must be shown. Show unit prices in both words and figures; where conflicts occur, the written words will take precedence and be used to determine the total amount bid. The total bid amount shall include all work as included in the contract documents and applicable tax.\n"]
[]
[null,null,null,null,null,null,null,null,null,{"$f":"J19","v":132000}]
["Item No.","DESCRIPTION","WSDOT Standard Item No.","WSDOT\nSpec\nRef Sect","Approx. Quantity","UNIT","Unit Price","Total Price","Unit Price","Total Price"]
[]
[null,"PREPARATION"]
[401,{"$f":"VLOOKUP(C10,'Detail List'!$A$2:$G$5000,3,FALSE)","v":"MOBILIZATION"},"0001","1-09.7",1,{"$f":"VLOOKUP(C10,'Detail List'!$A$2:$I$5000,2,FALSE)","v":"L.S."},"$","$",5000,{"$f":"E10*I10","v":5000}]
[null,"(Unit Price in Words) ___________________________________________________"]
[]
[null,"TRAFFIC"]
[402,{"$f":"VLOOKUP(C14,'Detail List'!$A$2:$G$5000,3,FALSE)","v":"CEMENT CONC. TRAFFIC CURB AND GUTTER"},"6700","8-04.5",{"$f":"Quantities!C17","v":4900},{"$f":"VLOOKUP(C14,'Detail List'!$A$2:$I$5000,2,FALSE)","v":"L.F."},"$","$",25,{"$f":"E14*I14","v":122500}]
[null,"(Unit Price in Words) ___________________________________________________"]
[]
[null,null,null,null,null,null,"TOTAL CURB ALTERNATIVE 2",null,"Subtototal",{"$f":"SUM(J8:J16)","v":127500}]
[null,null,null,null,null,null,null,null,"Contingency",{"$f":"132000-J17","v":4500},{"$f":"J18/J17","v":3.5294117647058823E-2}]
[null,null,null,null,null,null,null,null,"TOTAL",{"$f":"SUM(J17:J18)","v":132000}]

{"sheet":"Add Alt 3 - Nontax","index":6,"n_rows":55,"n_cols":12,"rows_kept":55,"cut":false,"hidden":false,"merged":[[3,0,5,7]]}
["Alternative 3 Bid Schedule - Plantings"]
["City of Arlington"]
["Airport Blvd Phase 1A"]
["NOTE: All entries must be typed or written in ink. Unit prices for all items, all extensions, lump sum prices, and the total amount of bid must be shown. Show unit prices in both words and figures; where conflicts occur, the written words will take precedence and be used to determine the total amount bid. The total bid amount shall include all work as included in the contract documents and applicable tax.\n"]
[]
[null,null,null,null,null,null,null,null,null,{"$f":"J55","v":479000}]
["Item No.","DESCRIPTION","WSDOT Standard Item No.","WSDOT\nSpec\nRef Sect","Approx. Quantity","UNIT","Unit Price","Total Price","Unit Price","Total Price","Material","labor"]
[]
[null,"PREPARATION"]
[501,{"$f":"VLOOKUP(C10,'Detail List'!$A$2:$G$5000,3,FALSE)","v":"MOBILIZATION"},"0001","1-09.7",1,{"$f":"VLOOKUP(C10,'Detail List'!$A$2:$I$5000,2,FALSE)","v":"L.S."},"$","$",28000,{"$f":"E10*I10","v":28000}]
[null,"(Unit Price in Words) ___________________________________________________"]
[]
[null,"EROSION CONTROL AND ROADSIDE RESTORATION"]
[502,"PSIPE CAPITAL PEAR","6552","7-05.4",39,{"$f":"VLOOKUP(C14,'Detail List'!$A$2:$I$5000,2,FALSE)","v":"EACH"},"$","$",{"$f":"SUM(K14:L14)","v":135},{"$f":"E14*I14","v":5265},105,30]
[null,"(Unit Price in Words) ___________________________________________________"]
[503,"PSIPE RED SUNSET","6552","7-05.4",24,{"$f":"VLOOKUP(C16,'Detail List'!$A$2:$I$5000,2,FALSE)","v":"EACH"},"$","$",{"$f":"SUM(K16:L16)","v":155},{"$f":"E16*I16","v":3720},125,30]
[null,"(Unit Price in Words) ___________________________________________________"]
[504,"PSIPE KARPICK","6552","7-05.4",285,{"$f":"VLOOKUP(C18,'Detail List'!$A$2:$I$5000,2,FALSE)","v":"EACH"},"$","$",{"$f":"SUM(K18:L18)","v":155},{"$f":"E18*I18","v":44175},125,30]
[null,"(Unit Price in Words) ___________________________________________________"]
[505,"PSIPE DWARF REDWIG DOGWOOD","6552","7-05.4",30,{"$f":"VLOOKUP(C20,'Detail List'!$A$2:$I$5000,2,FALSE)","v":"EACH"},"$","$",{"$f":"SUM(K20:L20)","v":38.75},{"$f":"E20*I20","v":1162.5},16.75,22]
[null,"(Unit Price in Words) ___________________________________________________"]
[506,"PSIPE SALAL SHRUB","6552","7-05.4",60,{"$f":"VLOOKUP(C22,'Detail List'!$A$2:$I$5000,2,FALSE)","v":"EACH"},"$","$",{"$f":"SUM(K22:L22)","v":26.25},{"$f":"E22*I22","v":1575},4.25,22]
[null,"(Unit Price in Words) ___________________________________________________"]
[507,"PSIPE MOCK ORANGE","6552","7-05.4",60,{"$f":"VLOOKUP(C24,'Detail List'!$A$2:$I$5000,2,FALSE)","v":"EACH"},"$","$",{"$f":"SUM(K24:L24)","v":38.5},{"$f":"E24*I24","v":2310},16.5,22]
[null,"(Unit Price in Words) ___________________________________________________"]
[508,"PSIPE STAR MAGNOLIA","6552","7-05.4",12,{"$f":"VLOOKUP(C26,'Detail List'!$A$2:$I$5000,2,FALSE)","v":"EACH"},"$","$",{"$f":"SUM(K26:L26)","v":46.5},{"$f":"E26*I26","v":558},24.5,22]
[null,"(Unit Price in Words) ___________________________________________________"]
[509,"PSIPE LEATHERLEAF VIBURNUM","6552","7-05.4",60,{"$f":"VLOOKUP(C28,'Detail List'!$A$2:$I$5000,2,FALSE)","v":"EACH"},"$","$",{"$f":"SUM(K28:L28)","v":41.5},{"$f":"E28*I28","v":2490},19.5,22]
[null,"(Unit Price in Words) ___________________________________________________"]
[510,"PSIPE HEATHER SPECIES","6552","7-05.4",392,{"$f":"VLOOKUP(C30,'Detail List'!$A$2:$I$5000,2,FALSE)","v":"EACH"},"$","$",{"$f":"SUM(K30:L30)","v":4.5},{"$f":"E30*I30","v":1764},2.5,2]
{"$rows_left_out":26}
{"sheet":"Detail List","index":7,"n_rows":3199,"n_cols":9,"rows_kept":3199,"cut":false,"hidden":false,"merged":[]}
["Standard Item Number","Unit of Measure","Standard Item description","Prequal Code","Item Use Instructions","Section","Section Code #","Item Construction Sequence","Measurement System\nEnglish, Metric, Common"]
["0001","L.S.","MOBILIZATION","A1","STANDARD ITEM","PREPARATION",1,1,"C"]
["0002","L.S.","MOBILIZATION","A1","REQUIRES SPECIAL PROV.","PREPARATION",1,2,"C"]
["0003","ACRE","TEST","A1","STANDARD ITEM","PREPARATION",1,86,"E"]
["0025","ACRE","CLEARING AND GRUBBING","D6","STANDARD ITEM","PREPARATION",1,3,"E"]
["0030","ACRE","CLEARING AND GRUBBING - SITE","D6","STANDARD ITEM","PREPARATION",1,5,"E"]
["0035","L.S.","CLEARING AND GRUBBING","D6","STD. ITEM, GSP REQUIRED","PREPARATION",1,7,"C"]
["0038","EST.","ARCHAEOLOGICAL AND HISTORICAL SALVAGE","A1","GSP ITEM","PREPARATION",1,13,"C"]
["0040","L.S.","CLEARING AND GRUBBING - SITE","D6","STD. ITEM, GSP REQUIRED","PREPARATION",1,8,"C"]
["0044","C.Y.","STRIPPING INCL. HAUL","D6","STANDARD ITEM","PREPARATION",1,11,"E"]
["0045","C.Y.","STRIPPING INCL. HAUL - SITE","D6","STANDARD ITEM","PREPARATION",1,12,"E"]
["0047","EACH","REMOVING MANHOLE","G2","REQUIRES SPECIAL PROV.","PREPARATION",1,14,"C"]
["0049","EACH","REMOVING DRAINAGE STRUCTURE","G2","REQUIRES SPECIAL PROV.","PREPARATION",1,15,"C"]
["0050","L.S.","REMOVAL OF STRUCTURE AND OBSTRUCTION","F8","STD. ITEM, GSP REQUIRED","PREPARATION",1,16,"C"]
["0060","L.S.","REMOVING PORTION OF EXISTING STRUCTURE","F8","REQUIRES SPECIAL PROV.","PREPARATION",1,23,"C"]
["0061","L.S.","REMOVING PORTION OF EXISTING BRIDGE","F8","GSP ITEM","PREPARATION",1,24,"C"]
["0062","L.S.","REMOVING PORTION OF CONC. BOX CULV.","F8","REQUIRES SPECIAL PROV.","PREPARATION",1,25,"C"]
["0070","L.S.","REMOVING EXISTING STRUCTURE","F8","GSP ITEM","PREPARATION",1,26,"C"]
["0071","L.S.","REMOVING EXISTING BRIDGE","F8","GSP ITEM","PREPARATION",1,27,"C"]
["0080","S.Y.","REMOVING BITUMINOUS PAVEMENT","D6","REQUIRES SPECIAL PROV.","PREPARATION",1,29,"E"]
["0090","S.Y.","REMOVING CEMENT CONC. PAVEMENT","D6","GSP ITEM","PREPARATION",1,31,"E"]
["0100","S.Y.","REMOVING CEMENT CONC. SIDEWALK","D6","REQUIRES SPECIAL PROV.","PREPARATION",1,33,"E"]
["0108","L.F.","REMOVING CEMENT CONC. CURB AND GUTTER","D6","REQUIRES SPECIAL PROV.","PREPARATION",1,35,"E"]
["0110","L.F.","REMOVING CEMENT CONC. CURB","D6","GSP ITEM","PREPARATION",1,37,"E"]
["0114","L.F.","REMOVING CEMENT CONC. GUTTER","D6","REQUIRES SPECIAL PROV.","PREPARATION",1,39,"E"]
["0116","EACH","REMOVING CONC. INLET","D6","REQUIRES SPECIAL PROV.","PREPARATION",1,28,"C"]
["0120","S.Y.","REMOVING ASPHALT CONC. PAVEMENT","D6","GSP ITEM","PREPARATION",1,41,"E"]
["0130","S.Y.","REMOVING ASPHALT CONC. SIDEWALK","D6","GSP ITEM","PREPARATION",1,43,"E"]
["0140","L.F.","REMOVING ASPHALT CONC. CURB","D6","GSP ITEM","PREPARATION",1,45,"E"]
["0145","L.F.","REMOVING CONC. BARRIER","N0","REQUIRES SPECIAL PROV.","PREPARATION",1,47,"E"]
{"$rows_left_out":3170}
{"sheet":"Quantities","index":8,"n_rows":109,"n_cols":9,"rows_kept":109,"cut":false,"hidden":false,"merged":[]}
["Asphalt"]
[null,"New Area"]
[null,null,116402,"sf"]
[null,"Patch Area"]
[null,null,{"$f":"10*(18+12+10+5)","v":450},"sf"]
[null,"4\" HMA"]
[null,null,{"$f":"(C3+C5)*0.33/27","v":1428.1911111111112},"cy"]
[null,null,{"$f":"C7*2.05","v":2927.791777777778},"ton"]
[]
["Sidewalk"]
[null,"Area"]
[null,null,3125,"sy"]
[]
["Curb and Gutter"]
[]
[null,"Length"]
[null,null,4900,"lf"]
[]
["Agregate"]
[null,"9\" Roadway Basecourse"]
[null,null,{"$f":"0.75*C3/27","v":3233.3888888888887},"cy"]
[null,null,{"$f":"C21*1.85","v":5981.7694444444442},"ton"]
[null,"2\" sidewalk topcourse"]
[null,null,{"$f":"C12*9*0.167/27","v":173.95833333333334},"cy"]
[null,null,{"$f":"C24*1.85","v":321.82291666666669},"ton"]
[]
["Sawcutting"]
[null,"Longitudinal Joint"]
[null,null,{"$f":"4048.42-2100+10*4","v":1988.42},"lf"]
[null,"Lateral Joint"]
{"$rows_left_out":79}